{"text_format":"1","workbook":"xlsx","n_sheets":7,"sheets":["SMI Analyse KGV","Sicherheitsmarge nach Graham","Analysemöglichkeiten","Daten","Tabelle1","Währungskurse","alte Firmen"],"not_rendered":{"charts":0,"images":0,"macros":1,"external_links":0,"defined_names":0,"comments":1,"pivot_tables":0},"unopened":[],"bounds":{"document_bytes":16777216,"sheet_cells":100000,"rows_first":2000,"rows_last":500,"rows_between":2000,"halvings":0,"cell_chars":16384,"cell_head_chars":4096},"cells_cut":0,"cells_raw":0,"read":"whole","date_system":"1900"}

{"sheet":"SMI Analyse KGV","index":0,"n_rows":171,"n_cols":88,"rows_kept":171,"cut":false,"hidden":false,"merged":[[8,13,8,22],[59,4,59,9],[59,10,59,19]]}
[null,null,null,null,null,null,null,null,null,null,null,null,null,null,null,null,null,null,null,null,null,null,null,null,null,null,null,null,null,null,null,null,null,null,null,null,null,null,null,null,null,null,null,null,null,null,null,null,null,null,18]
[]
["Financial Analysis SMI/SMIM et al.",null,null,"per",null,null,null,null,null,null,null,null,{"$f":"Daten!H3","v":20250124},{"$f":"Daten!H3","v":20250124},null,null,null,null,null,null,null,"Kolonnen E - L einblenden für weitere Gewinndaten!"]
[]
[null,null," ",{"$f":"C5","v":" "},null,null,null,null,null,null,null,null,null,null,null,"KGV 2022  gewichtet SMI",{"$f":"BT55/BW55","v":27.5404521135575},{"$f":"Q5","v":27.5404521135575},null," ",null,null,"letzter ausgewiesener Jahresabschluss",null,null,null,null,null,null,null,null,null,null,null,null,{"$f":"$AN$2","v":0},"Bewertung günstig"]
[null,"KGV Ø Gewinn 10 Jahre gewichtet SMI",{"$f":"BT55/BU55","v":31.5356504185488},{"$f":"C6","v":31.5356504185488},null,null,null,null,null,null,null,null,null,null,null,"KGV 2023 gewichtet SMI",{"$f":"BT55/BV55","v":25.4651783621442},{"$f":"Q6","v":25.4651783621442},null," ",null,null,"Schätzung",null,null,null,null,null,null,null,null,null,null,null,null,{"$f":"$AY$1","v":18},"Bewertung teuer",null,null,null,null,null,null,null,null,null,null,null,null,null,null,null,"Abschlusses"]
[null,"KGV Ø Gewinn 10 Jahre gewichtet SMIM",{"$f":"BT152/BU152","v":51.7096080032651},{"$f":"C7","v":51.7096080032651},null,null,null,null,null,null,null,null,null,null,null,"KGV 2023 gewichtet SMIM",{"$f":"BT152/BV152","v":35.6828782424996},{"$f":"Q7","v":35.6828782424996}]
[null,null,null,null,null,null," "]
[null,null,null,"Ø Gewinn",null,null,"Gewinn pro Aktie",null,null,null,null,null,null,"Gewinn pro Aktie",null,null,null,null,null,null,null,null,null,"akt. Kurs",null,"akt. Kurs",null,"KGV 2005",null,"KGV 2006",null,"KGV 2007",null,"KGV 2008",null,null,null,null,null,null,null,null,null,null," ",null," ",null,"KGV 2016",null,"KGV 2015",null,"KGV 2014",null,"KGV 2012",null,"KGV 2011",null,"KGV 2010",null,null,"KGV 2009",null,"Ø Gewinn",null,"Ø Gewinnverän-",null,"Ø Gewinn-",null,null,"Gewichtung","gewichteter","gewichteter","gewichteter","gewichteter","gewichtetes","gewichtetes","gewichtetes","gewichtetes","gewichtetes","gewichtetes","gewichtetes","gewichtetes","gewichtetes","gewichtetes","gewichtetes",null,"Gewichtung"]
[" ",null,null,"2014 - 2023",2005,2006,2007,2008,2009,2010,2011,2012,2013,2014,2015,2016,2017,2018,2019,2020,2021,2022,2023,null,null,"in RW",null,null,null,null,null,null,null,null,"KGV2023",null,"KGV2022",null,"KGV2021",null,"KGV2020",null,"KGV2019",null,"KGV2018",null,"KGV2017",null,null,null,null,null,null,null,null,null,null,null,null,null,null,null,null,"14-23 KGV",null,"derungsraten 10J",null,"wachstum 10 J",null,null,"per 28.6.24","Preis","Gewinn 14 -23","Gewinn 2023","Gewinn 2022","KGV2021","KGV2020","KGV2019","KGV2018","KGV2017","KGV2016","KGV2015","KGV2014","KGV12","KGV11","KGV10",null,"per 16.3.10"]
[null,null,null,null,null,null,null,null,null,null,null,null,null,null,null,null,null,null,null,null,null,null,null,null,null,null,null,null,null,null,null,null,null,null,null,null,null,null,null,null,null,null,null,null,null,null,null,null,null,null,null,null,null,null,null,null,null,null,null,null,null,null,null,null,null,null,null,null,null,null,"gem. ETF SMI iShares"]
[]
["SMI Titel"]
[]
["USD","ABB LTD N","ABBN",{"$f":"SUM(N15:W15)/10","v":1.363},0.36,0.63,1.63,1.36,1.27,1.12,1.38,1.18,1.21,1.13,0.87,0.88,1.04,1.02,0.67,2.44,2.27,1.3,2.01,{"$f":"LOOKUP(C15,Daten!$C$2:$C$300,Daten!$E$2:$E$500)","v":54},null,{"$f":"X15/Währungskurse!C$4","v":59.3406593406593},null,{"$f":"Z15/E15","v":164.835164835165},null,{"$f":"Z15/F15","v":94.1915227629513},null,{"$f":"Z15/G15","v":36.4053124789321},null,{"$f":"Z15/H15","v":43.6328377504848},{"$f":"Z15/W15","v":29.5227160898803},{"$f":"AI15","v":29.5227160898803},{"$f":"Z15/V15","v":45.6466610312764},{"$f":"AK15","v":45.6466610312764},{"$f":"Z15/U15","v":26.1412596214358},{"$f":"AM15","v":26.1412596214358},{"$f":"Z15/T15","v":24.3199423527292},{"$f":"AO15","v":24.3199423527292},{"$f":"Z15/S15","v":88.5681482696408},{"$f":"AQ15","v":88.5681482696408},{"$f":"Z15/R15","v":58.1771170006464},{"$f":"AS15","v":58.1771170006464},{"$f":"Z15/Q15","v":57.0583262890955},{"$f":"AU15","v":57.0583262890955},{"$f":"Z15/P15","v":67.4325674325674},{"$f":"AW15","v":67.4325674325674},{"$f":"Z15/O15","v":68.207654414551},{"$f":"AY15","v":68.207654414551},{"$f":"Z15/N15","v":52.5138578235923},{"$f":"BA15","v":52.5138578235923},{"$f":"Z15/L15","v":50.288694356491},{"$f":"BC15","v":50.288694356491},{"$f":"Z15/K15","v":43.0004777830865},{"$f":"BE15","v":43.0004777830865},{"$f":"Z15/J15","v":52.9827315541601},{"$f":"BG15","v":52.9827315541601},null,{"$f":"Z15/I15","v":46.7249286146924},{"$f":"BJ15","v":46.7249286146924},{"$f":"Z15/D15","v":43.5368006901389},{"$f":"BL15","v":43.5368006901389},{"$f":"Tabelle1!N13","v":0.222570019695648},{"$f":"IF(BN15>0,BN15,10)","v":0.222570019695648},{"$f":"IF(W15>N15,(W15-N15)/N15,-(N15-W15)/N15)","v":0.778761061946903},{"$f":"BP15","v":0.778761061946903},null,6.39,{"$f":"BS15/100*Z15","v":3.79186813186813},{"$f":"D15*(BS15/100)","v":0.0870957},{"$f":"W15*(BS15/100)","v":0.128439},{"$f":"V15*(BS15/100)","v":0.08307},{"$f":"AM15*BS15","v":167.042648980975},{"$f":"AO15*BS15","v":155.40443163394},{"$f":"AQ15*BS15","v":565.950467443005},{"$f":"AS15*BS15","v":371.751777634131},{"$f":"AU15*BS15","v":364.60270498732},{"$f":"AW15*BS15","v":430.894105894106},{"$f":"AY15*BS15","v":435.846911708981},{"$f":"BA15*BS15","v":335.563551492755},{"$f":"BC15*BS15","v":321.344756937977},{"$f":"BE15*BS15","v":274.773053033923},{"$f":"BG15*BS15","v":338.559654631083},null,6.09]
{"$rows_left_out":157}
{"sheet":"Sicherheitsmarge nach Graham","index":1,"n_rows":144,"n_cols":33,"rows_kept":144,"cut":false,"hidden":false,"merged":[[7,10,7,19],[64,2,64,5],[66,2,66,6],[68,2,68,6],[74,2,74,7],[76,2,76,7],[78,2,78,7],[80,2,80,7],[82,2,82,9],[84,2,84,7],[86,2,86,6],[88,2,88,6],[90,2,90,6],[92,2,92,6],[94,2,94,7]]}
[]
[]
[null,"Sicherheitsmarge nach Graham"]
[]
[null,"Umlaufrenditen der Obligationen im Schnitt in %",null,null,null,null,0,null,{"$f":"K5","v":0},0,0,1.1,1.1,1.1]
[null,"Sicherheitsmarge muss grösser als 5%-Punkte sein"]
[]
[null,null,null,null,null,null,null,"Gewinn pro Aktie"," ",null,"Gewinn pro Aktie",null,null,null,null,null,null,null,null,null,null,null,null,"akt. Kurs",null,"akt. Kurs ",null,"Ø Gewinn",null,"Gewinn-",null,"Sicherheitsmarge"]
[null,"SMI Titel",null,null,2005,2006,2007,2008,2009,2010,2011,2012,2013,2014,2015,2016,2017,2018,2019,2020,2021,2022,2023,null,null,"in RW",null,"2014-2023",null,"rendite",null,">=5% Punkte"]
[]
[]
[null,"USD","ABB LTD N","ABBN",{"$f":"'SMI Analyse KGV'!E15","v":0.36},{"$f":"'SMI Analyse KGV'!F15","v":0.63},{"$f":"'SMI Analyse KGV'!G15","v":1.63},{"$f":"'SMI Analyse KGV'!H15","v":1.36},{"$f":"'SMI Analyse KGV'!I15","v":1.27},{"$f":"'SMI Analyse KGV'!J15","v":1.12},{"$f":"'SMI Analyse KGV'!K15","v":1.38},{"$f":"'SMI Analyse KGV'!L15","v":1.18},{"$f":"'SMI Analyse KGV'!M15","v":1.21},{"$f":"'SMI Analyse KGV'!N15","v":1.13},{"$f":"'SMI Analyse KGV'!O15","v":0.87},{"$f":"'SMI Analyse KGV'!P15","v":0.88},{"$f":"'SMI Analyse KGV'!Q15","v":1.04},{"$f":"'SMI Analyse KGV'!R15","v":1.02},{"$f":"'SMI Analyse KGV'!S15","v":0.67},{"$f":"'SMI Analyse KGV'!T15","v":2.44},{"$f":"'SMI Analyse KGV'!U15","v":2.27},{"$f":"'SMI Analyse KGV'!V15","v":1.3},{"$f":"'SMI Analyse KGV'!W15","v":2.01},{"$f":"LOOKUP(D12,Daten!$C$2:$C$300,Daten!$E$2:$E$500)","v":54},null,{"$f":"X12/Währungskurse!C$4","v":59.3406593406593},null,{"$f":"SUM(N12:W12)/10","v":1.363},null,{"$f":"AB12/Z12*100","v":2.29690740740741},null,{"$f":"AD12-$N$5","v":1.19690740740741},{"$f":"AF12","v":1.19690740740741}]
[null,null," "," "]
[null,"USD","ALCON N","ALC",null,null,null,null,null,null,null,null,null,null,null,null,{"$f":"'SMI Analyse KGV'!Q17","v":0.52},{"$f":"'SMI Analyse KGV'!R17","v":-0.46},{"$f":"'SMI Analyse KGV'!S17","v":-1.34},{"$f":"'SMI Analyse KGV'!T17","v":-1.09},{"$f":"'SMI Analyse KGV'!U17","v":0.76},{"$f":"'SMI Analyse KGV'!V17","v":0.68},{"$f":"'SMI Analyse KGV'!W17","v":1.96},{"$f":"LOOKUP(D14,Daten!$C$2:$C$300,Daten!$E$2:$E$500)","v":80.62},null,{"$f":"X14/Währungskurse!C$5","v":84.8631578947368},null,{"$f":"SUM(N14:W14)/10","v":0.103},null,{"$f":"AB14/Z14*100","v":0.121371868022823},null,{"$f":"AD14-$N$5","v":-0.978628131977177},{"$f":"AF14","v":-0.978628131977177}]
[]
{"$rows_left_out":130}
{"sheet":"Analysemöglichkeiten","index":2,"n_rows":17,"n_cols":2,"rows_kept":17,"cut":false,"hidden":false,"merged":[]}
[]
[]
[]
[]
[]
[]
[]
[]
[null,"Analysemöglichkeiten"]
[]
[null,"1. Suchen Sie nach Firmen, deren KGV (= Kurs-Gewinn Verhältnis) unter 16 liegt (Ticker grün). Entweder neuestes KGV oder, etwas konservativer, KGV des durchschnittlichen Gewinnes über 10 Jahre."]
[]
[null,"2. Alternativ suchen Sie nach Firmen, deren Sicherheitsmarge grösser als 5% Punkte ist (Ticker grün)."]
[]
[null,"3. Untersuchen Sie bei diesen Firmen, ob Sie eine über 10 Jahre insgesamt eine Gewinnsteigerung von über 160 % ausweisen."]
{"$rows_left_out":3}
{"sheet":"Daten","index":3,"n_rows":261,"n_cols":26,"rows_kept":261,"cut":false,"hidden":false,"merged":[]}
["ShortName","ISIN","ValorSymbol","ValorNumber","ClosingPrice","DailyHighPrice","DailyLowPrice","LatestTradeDate","PreviousClosingPrice","OpeningPrice","OnMarketVolume","OffBookVolume","SwissAtMidVolume","TotalVolume","TradingBaseCurrency","YearlyHighDate","YearlyHighPrice","YearlyLowDate","YearlyLowPrice","FirstTradingDate","LastTradingDate","Exchange","SecTypeCode","GeographicalAreaCode","Tminus1Volume","VWAP60Price"]
["ANGLO PLC","GB00B1XZS820","AAM",3186826,28.8,28.8,28.8,20250124,27.4,28.8,650,0,0,650,"CHF",20240513,31.2,20240219,19.6,20070703,null,"XSWX","RS","GB",0,28.5]
["ABB LTD N","CH0012221716","ABBN",1222171,54,54,53.64,20250124,53.58,53.7,2244227,16500,58354,2319081,"CHF",20250124,54,20240201,36.47,20201207,null,"XSWX","RS","CH",0,50.16]
["ABB LTD N 2. LINIE","CH0357679619","ABBNE",35767961,53.9,54.06,53.82,20250124,53.38,53.92,96684,0,0,96684,"CHF",20250124,54.06,20240129,36.64,20240402,20250131,"XSWX","RS","CH",0,50.09]
["ABBOTT LABOR","US0028241000","ABT",903037,93.5,null,null,20240930,93.5,null,0,0,0,0,"CHF",20240905,96,20240815,92,19951208,null,"XSWX","RS","US",0]
["ACCELLERON N","CH1169360919","ACLN",116936091,46.42,46.96,46.3,20250124,46.3,46.54,119103,0,2283,121386,"CHF",20241111,51.6,20240129,27.1,20221003,null,"XSWX","RS","CH",0,47.55]
["ADECCO N","CH0012138605","ADEN",1213860,21.7,21.96,21.32,20250124,21.2,21.32,1050994,0,67131,1118125,"CHF",20240229,38.08,20250113,20.32,20201207,null,"XSWX","RS","CH",0,23.37]
["ADVAL TECH N","CH0008967926","ADVN",896792,71,71,70,20250124,71,70,31,0,0,31,"CHF",20240209,112,20241111,67,19980604,null,"XSWX","RS","CH",0,73.85]
["ADDEX N","CH0029850754","ADXN",2985075,0.0632,0.064,0.0602,20250124,0.0632,0.0602,41130,0,0,41130,"CHF",20240409,0.26,20240429,0.05,20070522,null,"XSWX","RS","CH",0,0.07]
["MONTANA N","CH1110425654","AERO",111042565,14.96,15.18,14.88,20250124,15,15.06,14728,0,180,14908,"CHF",20240926,21.45,20241223,13.8,20210512,null,"XSWX","RS","CH",0,14.98]
["AEVIS N","CH0478634105","AEVS",47863410,14,14.1,14,20250124,14.3,14.1,479,0,0,479,"CHF",20240129,17,20240925,12.8,20190607,null,"XSWX","RS","CH",0,14.05]
["ALUFLEXPACK N","CH0453226893","AFP",45322689,15.1,15.1,15.1,20250124,15.2,15.1,8,0,0,8,"CHF",20240216,16.1,20240207,7.42,20190628,null,"XSWX","RS","CH",0,14.89]
["ALUFLEXPACK 2. LINIE","CH1336609149","AFPE",133660914,15.6,15.6,15.55,20250124,15.6,15.55,5696,2076,0,7772,"CHF",20240522,16.2,20240516,14.5,20240417,20250331,"XSWX","RS","CH",0,15.31]
["AIRESIS N","CH0010947627","AIRE",1094762,0.053,0.054,0.053,20250124,0.062,0.054,30053,0,0,30053,"CHF",20240213,0.54,20241205,0.04,20000717,null,"XSWX","RS","CH",0,0.06]
["ALCON N","CH0432492467","ALC",43249246,80.62,80.98,80.02,20250124,80.46,80.8,723921,0,19996,743917,"CHF",20240913,85.34,20240129,64.32,20201207,null,"XSWX","RS","CH",0,77.42]
{"$rows_left_out":247}
{"sheet":"Tabelle1","index":4,"n_rows":149,"n_cols":14,"rows_kept":149,"cut":false,"hidden":false,"merged":[[61,2,61,11]]}
[null,null,"VERÄNDERUNGSRATEN",null,null,null,null,null,null,null,null,null,null,"Durchschnittliche Gewinnveränderungsraten"]
[null,null,"2013","2014","2015","2016","2017","2018","2019","2020","2021","2022","2023"]
[]
[]
[]
[]
[]
[]
[]
[]
[]
[]
[null,"ABB LTD N ",{"$f":"('SMI Analyse KGV'!M15-'SMI Analyse KGV'!L15)/ABS('SMI Analyse KGV'!L15)","v":0.0254237288135593},{"$f":"('SMI Analyse KGV'!N15-'SMI Analyse KGV'!M15)/ABS('SMI Analyse KGV'!M15)","v":-0.0661157024793389},{"$f":"('SMI Analyse KGV'!O15-'SMI Analyse KGV'!N15)/ABS('SMI Analyse KGV'!N15)","v":-0.230088495575221},{"$f":"('SMI Analyse KGV'!P15-'SMI Analyse KGV'!O15)/ABS('SMI Analyse KGV'!O15)","v":0.0114942528735632},{"$f":"('SMI Analyse KGV'!Q15-'SMI Analyse KGV'!P15)/ABS('SMI Analyse KGV'!P15)","v":0.181818181818182},{"$f":"('SMI Analyse KGV'!R15-'SMI Analyse KGV'!Q15)/ABS('SMI Analyse KGV'!Q15)","v":-0.0192307692307692},{"$f":"('SMI Analyse KGV'!S15-'SMI Analyse KGV'!R15)/ABS('SMI Analyse KGV'!R15)","v":-0.343137254901961},{"$f":"('SMI Analyse KGV'!T15-'SMI Analyse KGV'!S15)/ABS('SMI Analyse KGV'!S15)","v":2.64179104477612},{"$f":"('SMI Analyse KGV'!U15-'SMI Analyse KGV'!T15)/ABS('SMI Analyse KGV'!T15)","v":-0.069672131147541},{"$f":"('SMI Analyse KGV'!V15-'SMI Analyse KGV'!U15)/ABS('SMI Analyse KGV'!U15)","v":-0.427312775330396},{"$f":"('SMI Analyse KGV'!W15-'SMI Analyse KGV'!V15)/ABS('SMI Analyse KGV'!V15)","v":0.546153846153846},{"$f":"AVERAGE(D13:M13)","v":0.222570019695648}]
[null," "]
[null,"ALCON N 1)"," "," "," "," "," ",{"$f":"('SMI Analyse KGV'!R17-'SMI Analyse KGV'!Q17)/ABS('SMI Analyse KGV'!Q17)","v":-1.88461538461538},{"$f":"('SMI Analyse KGV'!S17-'SMI Analyse KGV'!R17)/ABS('SMI Analyse KGV'!R17)","v":-1.91304347826087},{"$f":"('SMI Analyse KGV'!T17-'SMI Analyse KGV'!S17)/ABS('SMI Analyse KGV'!S17)","v":0.186567164179104},{"$f":"('SMI Analyse KGV'!U17-'SMI Analyse KGV'!T17)/ABS('SMI Analyse KGV'!T17)","v":1.69724770642202},{"$f":"('SMI Analyse KGV'!V17-'SMI Analyse KGV'!U17)/ABS('SMI Analyse KGV'!U17)","v":-0.105263157894737},{"$f":"('SMI Analyse KGV'!W17-'SMI Analyse KGV'!V17)/ABS('SMI Analyse KGV'!V17)","v":1.88235294117647},{"$f":"AVERAGE(D15:M15)","v":-0.0227923681655663}]
{"$rows_left_out":135}
{"sheet":"Währungskurse","index":5,"n_rows":5,"n_cols":3,"rows_kept":5,"cut":false,"hidden":false,"merged":[]}
[]
[null,"Währungskurse"]
[]
[null,"USD",0.91]
[null,"EUR",0.95]

{"sheet":"alte Firmen","index":6,"n_rows":3,"n_cols":69,"rows_kept":3,"cut":false,"hidden":false,"merged":[]}
[]
[]
[null,"Bobst","BOBNN",{"$f":"SUM(N3:W3)/10","v":4.086},null,null,null,null,null,3,0.03,-0.43,1.59,3.06,3.55,5.08,6.93,3.84,4.12,1.85,5.51,6.92,null,68,null,null,null,null,null,null,null,null,null,null,{"$f":"X3/W3","v":{"$error":"#DIV/0!"}},{"$f":"AI3","v":{"$error":"#DIV/0!"}},{"$f":"X3/V3","v":9.82658959537572},{"$f":"AK3","v":9.82658959537572},{"$f":"X3/U3","v":12.3411978221416},{"$f":"AM3","v":12.3411978221416},{"$f":"X3/T3","v":36.7567567567568},{"$f":"AO3","v":36.7567567567568},{"$f":"X3/S3","v":16.504854368932},{"$f":"AQ3","v":16.504854368932},{"$f":"X3/R3","v":17.7083333333333},{"$f":"AS3","v":17.7083333333333},{"$f":"X3/Q3","v":9.81240981240981},{"$f":"AU3","v":9.81240981240981},null,null,null,null,null,null,null,null,null,null,null,null,null,null,null,{"$f":"X3/D3","v":16.6421928536466},{"$f":"BL3","v":16.6421928536466},{"$f":"#REF!","v":{"$error":"#REF!"}},{"$f":"IF(BN3>0,BN3,10)","v":{"$error":"#REF!"}},{"$f":"IF(W3>N3,(W3-N3)/N3,-(N3-W3)/N3)","v":-1},{"$f":"BP3","v":-1}]